menu
search Unirse Acceder

Building SQLite with Asylo

Ir al lab

86 Opiniones

Sunit M. · Se revisó hace alrededor de 1 mes

Harsh K. · Se revisó hace alrededor de 2 meses

123

hooligan t. · Se revisó hace 2 meses

Wojciech J. · Se revisó hace 2 meses

Takashi M. · Se revisó hace 3 meses

rahul g. · Se revisó hace 3 meses

Zala N. · Se revisó hace 4 meses

Akshobhya J. · Se revisó hace 4 meses

sailesh k. · Se revisó hace 4 meses

Abhishek R. · Se revisó hace 4 meses

Dipaditya D. · Se revisó hace 4 meses

Abhishek P. · Se revisó hace 5 meses

My bazel build failed. The only thing I changed was using curl instead of wget to download the .bazelrc file. (wget is not installed by default). The error I got when running the 'basel run' command follows: root@4be38610948f:/opt/my-project# bazel run --config=sgx-sim :asylo_sqlite INFO: Analyzed target //:asylo_sqlite (0 packages loaded, 0 targets configured). INFO: Found 1 target... ERROR: /root/.cache/bazel/_bazel_root/b6bc0828d5b43c7085b650e0698bf388/external/com_google_asylo/asylo/platform/posix/BUILD:68:11: C++ compilation of rule '@com_google_asylo//asylo/platform/posix:posix' failed (Exit 1): x86_64-elf-g++ failed: error executing command external/com_google_asylo_toolchain/toolchain/bin/x86_64-elf-g++ -isystemasylo/platform/posix/include -isystemasylo/platform/system/include ... (remaining 74 argument(s) skipped) Use --sandbox_debug to see verbose messages from the sandbox x86_64-elf-g++ failed: error executing command external/com_google_asylo_toolchain/toolchain/bin/x86_64-elf-g++ -isystemasylo/platform/posix/include -isystemasylo/platform/system/include ... (remaining 74 argument(s) skipped) Use --sandbox_debug to see verbose messages from the sandbox In file included from external/com_google_asylo_toolchain/toolchain/bin/../lib/gcc/x86_64-elf/7.4.0/../../../../x86_64-elf/include/sys/types.h:223:0, from external/com_google_asylo_toolchain/toolchain/bin/../lib/gcc/x86_64-elf/7.4.0/../../../../x86_64-elf/include/sys/unistd.h:12, from external/com_google_asylo_toolchain/toolchain/bin/../lib/gcc/x86_64-elf/7.4.0/../../../../x86_64-elf/include/unistd.h:4, from external/com_google_asylo_toolchain/toolchain/bin/../lib/gcc/x86_64-elf/7.4.0/../../../../x86_64-elf/include/pthread.h:25, from external/com_google_asylo/asylo/platform/posix/pthread.cc:19: external/com_google_asylo/asylo/platform/posix/pthread.cc:47:18: error: expected unqualified-id before numeric constant constexpr size_t PTHREAD_KEYS_MAX = 64; ^ Target //:asylo_sqlite failed to build Use --verbose_failures to see the command lines of failed build steps. INFO: Elapsed time: 40.046s, Critical Path: 9.77s INFO: 338 processes: 8 internal, 330 processwrapper-sandbox. FAILED: Build did NOT complete successfully FAILED: Build did NOT complete successfully root@4be38610948f:/opt/my-project#

Geoff S. · Se revisó hace 5 meses

Gilbert Q. · Se revisó hace 5 meses

failed to build - cannot start the SQLite... ERROR: /root/.cache/bazel/_bazel_root/b6bc0828d5b43c7085b650e0698bf388/external/com_google_asylo/asylo/platform/posix/BUILD:68:11: C++ compilation of rule '@com_google_asylo//asylo/platform/posix:posix' failed (Exit 1): x86_64-elf-g++ failed: error executing command external/com_google_asylo_toolchain/toolchain/bin/x86_64-elf-g++ -isystemasylo/platform/posix/include -isystemasylo/platform/system/include ... (remaining 74 argument(s) skipped)

Mikhail C. · Se revisó hace 5 meses

Bernard A. · Se revisó hace 7 meses

Pratik T. · Se revisó hace 7 meses

Damitha R. · Se revisó hace 7 meses

Damitha R. · Se revisó hace 7 meses

Lubna S. · Se revisó hace 7 meses

gga d. · Se revisó hace 7 meses

sqlite did not ran by Asylo.

Arnel Perez P. · Se revisó hace 8 meses

Lubna S. · Se revisó hace 8 meses

Antonio M. · Se revisó hace 8 meses

PengShi L. · Se revisó hace 9 meses