menu

Building SQLite with Asylo

Accéder à l'atelier

86 Avis

Sunit M. · Examiné il y a environ un mois

Harsh K. · Examiné il y a environ 2 mois

123

hooligan t. · Examiné il y a 2 mois

Wojciech J. · Examiné il y a 2 mois

Takashi M. · Examiné il y a 3 mois

rahul g. · Examiné il y a 3 mois

Zala N. · Examiné il y a 4 mois

Akshobhya J. · Examiné il y a 4 mois

sailesh k. · Examiné il y a 4 mois

Abhishek R. · Examiné il y a 4 mois

Dipaditya D. · Examiné il y a 4 mois

Abhishek P. · Examiné il y a 4 mois

My bazel build failed. The only thing I changed was using curl instead of wget to download the .bazelrc file. (wget is not installed by default). The error I got when running the 'basel run' command follows: root@4be38610948f:/opt/my-project# bazel run --config=sgx-sim :asylo_sqlite INFO: Analyzed target //:asylo_sqlite (0 packages loaded, 0 targets configured). INFO: Found 1 target... ERROR: /root/.cache/bazel/_bazel_root/b6bc0828d5b43c7085b650e0698bf388/external/com_google_asylo/asylo/platform/posix/BUILD:68:11: C++ compilation of rule '@com_google_asylo//asylo/platform/posix:posix' failed (Exit 1): x86_64-elf-g++ failed: error executing command external/com_google_asylo_toolchain/toolchain/bin/x86_64-elf-g++ -isystemasylo/platform/posix/include -isystemasylo/platform/system/include ... (remaining 74 argument(s) skipped) Use --sandbox_debug to see verbose messages from the sandbox x86_64-elf-g++ failed: error executing command external/com_google_asylo_toolchain/toolchain/bin/x86_64-elf-g++ -isystemasylo/platform/posix/include -isystemasylo/platform/system/include ... (remaining 74 argument(s) skipped) Use --sandbox_debug to see verbose messages from the sandbox In file included from external/com_google_asylo_toolchain/toolchain/bin/../lib/gcc/x86_64-elf/7.4.0/../../../../x86_64-elf/include/sys/types.h:223:0, from external/com_google_asylo_toolchain/toolchain/bin/../lib/gcc/x86_64-elf/7.4.0/../../../../x86_64-elf/include/sys/unistd.h:12, from external/com_google_asylo_toolchain/toolchain/bin/../lib/gcc/x86_64-elf/7.4.0/../../../../x86_64-elf/include/unistd.h:4, from external/com_google_asylo_toolchain/toolchain/bin/../lib/gcc/x86_64-elf/7.4.0/../../../../x86_64-elf/include/pthread.h:25, from external/com_google_asylo/asylo/platform/posix/pthread.cc:19: external/com_google_asylo/asylo/platform/posix/pthread.cc:47:18: error: expected unqualified-id before numeric constant constexpr size_t PTHREAD_KEYS_MAX = 64; ^ Target //:asylo_sqlite failed to build Use --verbose_failures to see the command lines of failed build steps. INFO: Elapsed time: 40.046s, Critical Path: 9.77s INFO: 338 processes: 8 internal, 330 processwrapper-sandbox. FAILED: Build did NOT complete successfully FAILED: Build did NOT complete successfully root@4be38610948f:/opt/my-project#

Geoff S. · Examiné il y a 5 mois

Gilbert Q. · Examiné il y a 5 mois

failed to build - cannot start the SQLite... ERROR: /root/.cache/bazel/_bazel_root/b6bc0828d5b43c7085b650e0698bf388/external/com_google_asylo/asylo/platform/posix/BUILD:68:11: C++ compilation of rule '@com_google_asylo//asylo/platform/posix:posix' failed (Exit 1): x86_64-elf-g++ failed: error executing command external/com_google_asylo_toolchain/toolchain/bin/x86_64-elf-g++ -isystemasylo/platform/posix/include -isystemasylo/platform/system/include ... (remaining 74 argument(s) skipped)

Mikhail C. · Examiné il y a 5 mois

Bernard A. · Examiné il y a 7 mois

Pratik T. · Examiné il y a 7 mois

Damitha R. · Examiné il y a 7 mois

Damitha R. · Examiné il y a 7 mois

Lubna S. · Examiné il y a 7 mois

gga d. · Examiné il y a 7 mois

sqlite did not ran by Asylo.

Arnel Perez P. · Examiné il y a 7 mois

Lubna S. · Examiné il y a 8 mois

Antonio M. · Examiné il y a 8 mois

PengShi L. · Examiné il y a 9 mois