menu

Building SQLite with Asylo

ラボに移動

86 レビュー

Mistry Sunit · 約1ヶ月前にレビュー済み

Kumar Harsh · 2ヶ月前にレビュー済み

123

test1 hooligan · 3ヶ月前にレビュー済み

Jaroszuk Wojciech · 3ヶ月前にレビュー済み

MIZOBUCHI Takashi · 4ヶ月前にレビュー済み

goswami rahul · 4ヶ月前にレビュー済み

Nidhi Zala · 4ヶ月前にレビュー済み

Jamadagni K R Akshobhya · 4ヶ月前にレビュー済み

kumar gandham sailesh · 4ヶ月前にレビュー済み

Raniwal Abhishek · 4ヶ月前にレビュー済み

Das Dipaditya · 4ヶ月前にレビュー済み

Patel Abhishek · 5ヶ月前にレビュー済み

My bazel build failed. The only thing I changed was using curl instead of wget to download the .bazelrc file. (wget is not installed by default). The error I got when running the 'basel run' command follows: root@4be38610948f:/opt/my-project# bazel run --config=sgx-sim :asylo_sqlite INFO: Analyzed target //:asylo_sqlite (0 packages loaded, 0 targets configured). INFO: Found 1 target... ERROR: /root/.cache/bazel/_bazel_root/b6bc0828d5b43c7085b650e0698bf388/external/com_google_asylo/asylo/platform/posix/BUILD:68:11: C++ compilation of rule '@com_google_asylo//asylo/platform/posix:posix' failed (Exit 1): x86_64-elf-g++ failed: error executing command external/com_google_asylo_toolchain/toolchain/bin/x86_64-elf-g++ -isystemasylo/platform/posix/include -isystemasylo/platform/system/include ... (remaining 74 argument(s) skipped) Use --sandbox_debug to see verbose messages from the sandbox x86_64-elf-g++ failed: error executing command external/com_google_asylo_toolchain/toolchain/bin/x86_64-elf-g++ -isystemasylo/platform/posix/include -isystemasylo/platform/system/include ... (remaining 74 argument(s) skipped) Use --sandbox_debug to see verbose messages from the sandbox In file included from external/com_google_asylo_toolchain/toolchain/bin/../lib/gcc/x86_64-elf/7.4.0/../../../../x86_64-elf/include/sys/types.h:223:0, from external/com_google_asylo_toolchain/toolchain/bin/../lib/gcc/x86_64-elf/7.4.0/../../../../x86_64-elf/include/sys/unistd.h:12, from external/com_google_asylo_toolchain/toolchain/bin/../lib/gcc/x86_64-elf/7.4.0/../../../../x86_64-elf/include/unistd.h:4, from external/com_google_asylo_toolchain/toolchain/bin/../lib/gcc/x86_64-elf/7.4.0/../../../../x86_64-elf/include/pthread.h:25, from external/com_google_asylo/asylo/platform/posix/pthread.cc:19: external/com_google_asylo/asylo/platform/posix/pthread.cc:47:18: error: expected unqualified-id before numeric constant constexpr size_t PTHREAD_KEYS_MAX = 64; ^ Target //:asylo_sqlite failed to build Use --verbose_failures to see the command lines of failed build steps. INFO: Elapsed time: 40.046s, Critical Path: 9.77s INFO: 338 processes: 8 internal, 330 processwrapper-sandbox. FAILED: Build did NOT complete successfully FAILED: Build did NOT complete successfully root@4be38610948f:/opt/my-project#

Scott Geoff · 5ヶ月前にレビュー済み

Quek Gilbert · 5ヶ月前にレビュー済み

failed to build - cannot start the SQLite... ERROR: /root/.cache/bazel/_bazel_root/b6bc0828d5b43c7085b650e0698bf388/external/com_google_asylo/asylo/platform/posix/BUILD:68:11: C++ compilation of rule '@com_google_asylo//asylo/platform/posix:posix' failed (Exit 1): x86_64-elf-g++ failed: error executing command external/com_google_asylo_toolchain/toolchain/bin/x86_64-elf-g++ -isystemasylo/platform/posix/include -isystemasylo/platform/system/include ... (remaining 74 argument(s) skipped)

Cherkas Mikhail · 5ヶ月前にレビュー済み

Abduba Bernard · 7ヶ月前にレビュー済み

Tamgole Pratik · 7ヶ月前にレビュー済み

Ranasinghe Damitha · 7ヶ月前にレビュー済み

Ranasinghe Damitha · 7ヶ月前にレビュー済み

Sarah Dhabir Lubna · 7ヶ月前にレビュー済み

dnnns gga · 7ヶ月前にレビュー済み

sqlite did not ran by Asylo.

Posadas Arnel Perez · 8ヶ月前にレビュー済み

Sarah Dhabir Lubna · 8ヶ月前にレビュー済み

Mesones Antonio · 9ヶ月前にレビュー済み

Lai PengShi · 9ヶ月前にレビュー済み