menu
search 가입 로그인

Building SQLite with Asylo

실습으로 이동

86 리뷰

Sunit M. · 약 1달 전에 리뷰됨

Harsh K. · 약 2달 전에 리뷰됨

123

hooligan t. · 2달 전에 리뷰됨

Wojciech J. · 2달 전에 리뷰됨

Takashi M. · 3달 전에 리뷰됨

rahul g. · 3달 전에 리뷰됨

Zala N. · 4달 전에 리뷰됨

Akshobhya J. · 4달 전에 리뷰됨

sailesh k. · 4달 전에 리뷰됨

Abhishek R. · 4달 전에 리뷰됨

Dipaditya D. · 4달 전에 리뷰됨

Abhishek P. · 5달 전에 리뷰됨

My bazel build failed. The only thing I changed was using curl instead of wget to download the .bazelrc file. (wget is not installed by default). The error I got when running the 'basel run' command follows: root@4be38610948f:/opt/my-project# bazel run --config=sgx-sim :asylo_sqlite INFO: Analyzed target //:asylo_sqlite (0 packages loaded, 0 targets configured). INFO: Found 1 target... ERROR: /root/.cache/bazel/_bazel_root/b6bc0828d5b43c7085b650e0698bf388/external/com_google_asylo/asylo/platform/posix/BUILD:68:11: C++ compilation of rule '@com_google_asylo//asylo/platform/posix:posix' failed (Exit 1): x86_64-elf-g++ failed: error executing command external/com_google_asylo_toolchain/toolchain/bin/x86_64-elf-g++ -isystemasylo/platform/posix/include -isystemasylo/platform/system/include ... (remaining 74 argument(s) skipped) Use --sandbox_debug to see verbose messages from the sandbox x86_64-elf-g++ failed: error executing command external/com_google_asylo_toolchain/toolchain/bin/x86_64-elf-g++ -isystemasylo/platform/posix/include -isystemasylo/platform/system/include ... (remaining 74 argument(s) skipped) Use --sandbox_debug to see verbose messages from the sandbox In file included from external/com_google_asylo_toolchain/toolchain/bin/../lib/gcc/x86_64-elf/7.4.0/../../../../x86_64-elf/include/sys/types.h:223:0, from external/com_google_asylo_toolchain/toolchain/bin/../lib/gcc/x86_64-elf/7.4.0/../../../../x86_64-elf/include/sys/unistd.h:12, from external/com_google_asylo_toolchain/toolchain/bin/../lib/gcc/x86_64-elf/7.4.0/../../../../x86_64-elf/include/unistd.h:4, from external/com_google_asylo_toolchain/toolchain/bin/../lib/gcc/x86_64-elf/7.4.0/../../../../x86_64-elf/include/pthread.h:25, from external/com_google_asylo/asylo/platform/posix/pthread.cc:19: external/com_google_asylo/asylo/platform/posix/pthread.cc:47:18: error: expected unqualified-id before numeric constant constexpr size_t PTHREAD_KEYS_MAX = 64; ^ Target //:asylo_sqlite failed to build Use --verbose_failures to see the command lines of failed build steps. INFO: Elapsed time: 40.046s, Critical Path: 9.77s INFO: 338 processes: 8 internal, 330 processwrapper-sandbox. FAILED: Build did NOT complete successfully FAILED: Build did NOT complete successfully root@4be38610948f:/opt/my-project#

Geoff S. · 5달 전에 리뷰됨

Gilbert Q. · 5달 전에 리뷰됨

failed to build - cannot start the SQLite... ERROR: /root/.cache/bazel/_bazel_root/b6bc0828d5b43c7085b650e0698bf388/external/com_google_asylo/asylo/platform/posix/BUILD:68:11: C++ compilation of rule '@com_google_asylo//asylo/platform/posix:posix' failed (Exit 1): x86_64-elf-g++ failed: error executing command external/com_google_asylo_toolchain/toolchain/bin/x86_64-elf-g++ -isystemasylo/platform/posix/include -isystemasylo/platform/system/include ... (remaining 74 argument(s) skipped)

Mikhail C. · 5달 전에 리뷰됨

Bernard A. · 7달 전에 리뷰됨

Pratik T. · 7달 전에 리뷰됨

Damitha R. · 7달 전에 리뷰됨

Damitha R. · 7달 전에 리뷰됨

Lubna S. · 7달 전에 리뷰됨

gga d. · 7달 전에 리뷰됨

sqlite did not ran by Asylo.

Arnel Perez P. · 8달 전에 리뷰됨

Lubna S. · 8달 전에 리뷰됨

Antonio M. · 8달 전에 리뷰됨

PengShi L. · 9달 전에 리뷰됨