menu
search 加入 登录

Building SQLite with Asylo

转至实验

86 评价

Sunit M. · 已于 大约 1 个月前审核

Harsh K. · 已于 2 个月前审核

123

hooligan t. · 已于 3 个月前审核

Wojciech J. · 已于 3 个月前审核

Takashi M. · 已于 4 个月前审核

rahul g. · 已于 4 个月前审核

Zala N. · 已于 4 个月前审核

Akshobhya J. · 已于 4 个月前审核

sailesh k. · 已于 4 个月前审核

Abhishek R. · 已于 4 个月前审核

Dipaditya D. · 已于 4 个月前审核

Abhishek P. · 已于 5 个月前审核

My bazel build failed. The only thing I changed was using curl instead of wget to download the .bazelrc file. (wget is not installed by default). The error I got when running the 'basel run' command follows: root@4be38610948f:/opt/my-project# bazel run --config=sgx-sim :asylo_sqlite INFO: Analyzed target //:asylo_sqlite (0 packages loaded, 0 targets configured). INFO: Found 1 target... ERROR: /root/.cache/bazel/_bazel_root/b6bc0828d5b43c7085b650e0698bf388/external/com_google_asylo/asylo/platform/posix/BUILD:68:11: C++ compilation of rule '@com_google_asylo//asylo/platform/posix:posix' failed (Exit 1): x86_64-elf-g++ failed: error executing command external/com_google_asylo_toolchain/toolchain/bin/x86_64-elf-g++ -isystemasylo/platform/posix/include -isystemasylo/platform/system/include ... (remaining 74 argument(s) skipped) Use --sandbox_debug to see verbose messages from the sandbox x86_64-elf-g++ failed: error executing command external/com_google_asylo_toolchain/toolchain/bin/x86_64-elf-g++ -isystemasylo/platform/posix/include -isystemasylo/platform/system/include ... (remaining 74 argument(s) skipped) Use --sandbox_debug to see verbose messages from the sandbox In file included from external/com_google_asylo_toolchain/toolchain/bin/../lib/gcc/x86_64-elf/7.4.0/../../../../x86_64-elf/include/sys/types.h:223:0, from external/com_google_asylo_toolchain/toolchain/bin/../lib/gcc/x86_64-elf/7.4.0/../../../../x86_64-elf/include/sys/unistd.h:12, from external/com_google_asylo_toolchain/toolchain/bin/../lib/gcc/x86_64-elf/7.4.0/../../../../x86_64-elf/include/unistd.h:4, from external/com_google_asylo_toolchain/toolchain/bin/../lib/gcc/x86_64-elf/7.4.0/../../../../x86_64-elf/include/pthread.h:25, from external/com_google_asylo/asylo/platform/posix/pthread.cc:19: external/com_google_asylo/asylo/platform/posix/pthread.cc:47:18: error: expected unqualified-id before numeric constant constexpr size_t PTHREAD_KEYS_MAX = 64; ^ Target //:asylo_sqlite failed to build Use --verbose_failures to see the command lines of failed build steps. INFO: Elapsed time: 40.046s, Critical Path: 9.77s INFO: 338 processes: 8 internal, 330 processwrapper-sandbox. FAILED: Build did NOT complete successfully FAILED: Build did NOT complete successfully root@4be38610948f:/opt/my-project#

Geoff S. · 已于 5 个月前审核

Gilbert Q. · 已于 5 个月前审核

failed to build - cannot start the SQLite... ERROR: /root/.cache/bazel/_bazel_root/b6bc0828d5b43c7085b650e0698bf388/external/com_google_asylo/asylo/platform/posix/BUILD:68:11: C++ compilation of rule '@com_google_asylo//asylo/platform/posix:posix' failed (Exit 1): x86_64-elf-g++ failed: error executing command external/com_google_asylo_toolchain/toolchain/bin/x86_64-elf-g++ -isystemasylo/platform/posix/include -isystemasylo/platform/system/include ... (remaining 74 argument(s) skipped)

Mikhail C. · 已于 5 个月前审核

Bernard A. · 已于 7 个月前审核

Pratik T. · 已于 7 个月前审核

Damitha R. · 已于 7 个月前审核

Damitha R. · 已于 7 个月前审核

Lubna S. · 已于 7 个月前审核

gga d. · 已于 7 个月前审核

sqlite did not ran by Asylo.

Arnel Perez P. · 已于 8 个月前审核

Lubna S. · 已于 8 个月前审核

Antonio M. · 已于 9 个月前审核

PengShi L. · 已于 9 个月前审核